Target
Transient receptor potential cation channel subfamily M member 8
Ligand
BDBM50207661
Substrate
Meas. Tech.
ChEMBL_1632145 (CHEMBL3874851)
IC50
8100±n/a nM
Citation
 Kobayashi, JIHirasawa, HOzawa, TOzawa, TTakeda, HFujimori, YNakanishi, OKamada, NIkeda, T Synthesis and optimization of novela-phenylglycinamides as selective TRPM8 antagonists. Bioorg Med Chem 25:727-742 (2017)  
Target
Name:
Transient receptor potential cation channel subfamily M member 8
Synonyms:
LTRPC6 TRPM8_HUMAN Transient receptor potential M8 protein (TRPM8) Transient receptor potential cation channel subfamily M member 8 (TRPM8)
Type:
Enzyme
Mol. Mass.:
127693.26
Organism:
Homo sapiens (Human)
Description:
Q7Z2W7
Residue:
1104
  
Inhibitor
Name:
BDBM50207661
Synonyms:
CHEMBL3927831
Type:
Small organic molecule
Emp. Form.:
C22H19FN2O2
Mol. Mass.:
362.3969
SMILES:
NC(=O)[C@H](N(Cc1cccc(F)c1)C(=O)c1ccccc1)c1ccccc1
: