Target
Transient receptor potential cation channel subfamily M member 8
Ligand
BDBM50207665
Substrate
Meas. Tech.
ChEMBL_1632145 (CHEMBL3874851)
IC50
9100±n/a nM
Citation
 Kobayashi, JIHirasawa, HOzawa, TOzawa, TTakeda, HFujimori, YNakanishi, OKamada, NIkeda, T Synthesis and optimization of novela-phenylglycinamides as selective TRPM8 antagonists. Bioorg Med Chem 25:727-742 (2017)  
Target
Name:
Transient receptor potential cation channel subfamily M member 8
Synonyms:
LTRPC6 TRPM8_HUMAN Transient receptor potential M8 protein (TRPM8) Transient receptor potential cation channel subfamily M member 8 (TRPM8)
Type:
Enzyme
Mol. Mass.:
127693.26
Organism:
Homo sapiens (Human)
Description:
Q7Z2W7
Residue:
1104
  
Inhibitor
Name:
BDBM50207665
Synonyms:
CHEMBL3973096
Type:
Small organic molecule
Emp. Form.:
C22H21FN2O4S
Mol. Mass.:
428.477
SMILES:
COc1cc(CN(CC(N)=O)C(=O)c2cccs2)ccc1OCc1ccc(F)cc1
: