Target
Transient receptor potential cation channel subfamily M member 8
Ligand
BDBM50207689
Substrate
Meas. Tech.
ChEMBL_1632145 (CHEMBL3874851)
IC50
4700±n/a nM
Citation
 Kobayashi, JIHirasawa, HOzawa, TOzawa, TTakeda, HFujimori, YNakanishi, OKamada, NIkeda, T Synthesis and optimization of novela-phenylglycinamides as selective TRPM8 antagonists. Bioorg Med Chem 25:727-742 (2017)  
Target
Name:
Transient receptor potential cation channel subfamily M member 8
Synonyms:
LTRPC6 TRPM8_HUMAN Transient receptor potential M8 protein (TRPM8) Transient receptor potential cation channel subfamily M member 8 (TRPM8)
Type:
Enzyme
Mol. Mass.:
127693.26
Organism:
Homo sapiens (Human)
Description:
Q7Z2W7
Residue:
1104
  
Inhibitor
Name:
BDBM50207689
Synonyms:
CHEMBL3970879
Type:
Small organic molecule
Emp. Form.:
C23H19F3N2O3
Mol. Mass.:
428.4038
SMILES:
NC(=O)[C@H](N(Cc1cccc(OC(F)(F)F)c1)C(=O)c1ccccc1)c1ccccc1
: