Target
Transient receptor potential cation channel subfamily V member 4
Ligand
BDBM50207645
Substrate
Meas. Tech.
ChEMBL_1632171 (CHEMBL3874877)
IC50
>30000±n/a nM
Citation
 Kobayashi, JIHirasawa, HOzawa, TOzawa, TTakeda, HFujimori, YNakanishi, OKamada, NIkeda, T Synthesis and optimization of novela-phenylglycinamides as selective TRPM8 antagonists. Bioorg Med Chem 25:727-742 (2017)  
Target
Name:
Transient receptor potential cation channel subfamily V member 4
Synonyms:
TRPV4 Transient receptor potential cation channel subfamily V member 4 (TRPV4) VROAC
Type:
Enzyme
Mol. Mass.:
98290.10
Organism:
Homo sapiens (Human)
Description:
Q9HBA0
Residue:
871
  
Inhibitor
Name:
BDBM50207645
Synonyms:
CHEMBL3971179
Type:
Small organic molecule
Emp. Form.:
C23H20F2N2O2
Mol. Mass.:
394.4139
SMILES:
C[C@@H](N([C@@H](C(N)=O)c1ccccc1)C(=O)c1ccccc1)c1cc(F)cc(F)c1
: