Target
DNA topoisomerase 2-alpha
Ligand
BDBM50208197
Substrate
Meas. Tech.
ChEMBL_1632463 (CHEMBL3875255)
IC50
11250±n/a nM
Citation
 Palluotto, FSosic, APinato, OZoidis, GCatto, MSissi, CGatto, BCarotti, A Quinolino[3,4-b]quinoxalines and pyridazino[4,3-c]quinoline derivatives: Synthesis, inhibition of topoisomerase IIa, G-quadruplex binding and cytotoxic properties. Eur J Med Chem 123:704-717 (2016)  
Target
Name:
DNA topoisomerase 2-alpha
Synonyms:
DNA topoisomerase 2-alpha DNA topoisomerase II (Topo II) DNA topoisomerase II, alpha isozyme TOP2A Topoisomerase I/II | Topoisomerase II alpha (HuTopoIIα)
Type:
Protein
Mol. Mass.:
174415.30
Organism:
Homo sapiens (Human)
Description:
P11388
Residue:
1531
  
Inhibitor
Name:
BDBM50208197
Synonyms:
CHEMBL3884560
Type:
Small organic molecule
Emp. Form.:
C20H21N5
Mol. Mass.:
331.4142
SMILES:
CN(C)CCCNc1nc2ccccc2c2nc3ccccc3nc12
: