Target
Neuropilin-1
Ligand
BDBM50208993
Substrate
Meas. Tech.
ChEMBL_1633629 (CHEMBL3876421)
IC50
890±n/a nM
Citation
 Grabowska, KPuszko, AKLipinski, PFLaskowska, AKWilenska, BWitkowska, EPerret, GYMisicka, A Structure-activity relationship study of a small cyclic peptide H-c[Lys-Pro-Glu]-Arg-OH: a potent inhibitor of Vascular Endothelial Growth Factor interaction with Neuropilin-1. Bioorg Med Chem 25:597-602 (2017)  
Target
Name:
Neuropilin-1
Synonyms:
CD_antigen=CD304 Neuropilin-1 Vascular endothelial cell growth factor 165 receptor
Type:
PROTEIN
Mol. Mass.:
103073.15
Organism:
Rattus norvegicus
Description:
ChEMBL_109427
Residue:
922
  
Inhibitor
Name:
BDBM50208993
Synonyms:
CHEMBL3885318
Type:
Small organic molecule
Emp. Form.:
C44H76N16O12
Mol. Mass.:
1021.1742
SMILES:
NCCCC[C@@H]1NC(=O)[C@H](CCC(=O)N[C@@H](CCCNC(N)=N)C(O)=O)NC(=O)[C@H]2CCCN2C(=O)[C@@H](N)CCCCNC(=O)CC[C@H](NC(=O)[C@H]2CCCN2C1=O)C(=O)N[C@@H](CCCNC(N)=N)C(O)=O
: