Target
Adenosine receptor A2b
Ligand
BDBM50210818
Substrate
Meas. Tech.
ChEMBL_1635287 (CHEMBL3878185)
IC50
1000±n/a nM
Citation
 Alachouzos, GLenselink, EBMulder-Krieger, Tde Vries, HIJzerman, APLouvel, J Synthesis and evaluation of N-substituted 2-amino-4,5-diarylpyrimidines as selective adenosine A Eur J Med Chem 125:586-602 (2017)  
Target
Name:
Adenosine receptor A2b
Synonyms:
AA2BR_HUMAN ADORA2B Adenosine receptors A2b | Adenosine receptors; A2a & A2b
Type:
G Protein-Coupled Receptor (GPCR)
Mol. Mass.:
36341.22
Organism:
Homo sapiens (Human)
Description:
Residue:
332
  
Inhibitor
Name:
BDBM50210818
Synonyms:
CHEMBL3937015
Type:
Small organic molecule
Emp. Form.:
C26H25N3O
Mol. Mass.:
395.4962
SMILES:
O[C@H]1CC[C@@H](CC1)Nc1ncc(-c2ccc3ccccc3c2)c(n1)-c1ccccc1
: