Target
Aldo-keto reductase family 1 member B1
Ligand
BDBM50210922
Substrate
Meas. Tech.
ChEMBL_1635519 (CHEMBL3878417)
IC50
10700±n/a nM
Citation
 Saito, RHoshi, MKato, AIshikawa, CKomatsu, T Green fluorescent protein chromophore derivatives as a new class of aldose reductase inhibitors. Eur J Med Chem 125:965-974 (2017)  
Target
Name:
Aldo-keto reductase family 1 member B1
Synonyms:
AKR1B1 ALDR_HUMAN AR Aldose Reductase (ALR2) Aldose reductase (AR)
Type:
Protein
Mol. Mass.:
35855.50
Organism:
Homo sapiens (Human)
Description:
P15121. 4LAU; 2IKI; 4LB4; 2FZD; 2FZ8; 1US0
Residue:
316
  
Inhibitor
Name:
BDBM50210922
Synonyms:
CHEMBL3945763
Type:
Small organic molecule
Emp. Form.:
C14H14N2O4
Mol. Mass.:
274.272
SMILES:
CC1=N\C(=C/c2ccc(O)cc2)C(=O)N1CCC(O)=O
: