Target
Acetylcholinesterase
Ligand
BDBM50211400
Substrate
Meas. Tech.
ChEMBL_1636436 (CHEMBL3879334)
IC50
5050±n/a nM
Citation
 Kurt, BZGazioglu, IDag, ASalmas, REKayik, GDurdagi, SSonmez, F Synthesis, anticholinesterase activity and molecular modeling study of novel carbamate-substituted thymol/carvacrol derivatives. Bioorg Med Chem 25:1352-1363 (2017)  
Target
Name:
Acetylcholinesterase
Synonyms:
ACES_ELEEL Acetylcholinesterase (EeAChE) | ache
Type:
Enzyme
Mol. Mass.:
71812.79
Organism:
Electrophorus electricus (Electric eel)
Description:
Residue:
633
  
Inhibitor
Name:
BDBM50211400
Synonyms:
CHEMBL3976227
Type:
Small organic molecule
Emp. Form.:
C17H18N2O4
Mol. Mass.:
314.3358
SMILES:
CC(C)c1ccc(C)c(OC(=O)Nc2cccc(c2)[N+]([O-])=O)c1
: