Target
Cholinesterase
Ligand
BDBM50211401
Substrate
Meas. Tech.
ChEMBL_1636437 (CHEMBL3879335)
IC50
2540±n/a nM
Citation
 Kurt, BZGazioglu, IDag, ASalmas, REKayik, GDurdagi, SSonmez, F Synthesis, anticholinesterase activity and molecular modeling study of novel carbamate-substituted thymol/carvacrol derivatives. Bioorg Med Chem 25:1352-1363 (2017)  
Target
Name:
Cholinesterase
Synonyms:
BCHE CHLE_HORSE | Cholinesterase
Type:
Enzyme
Mol. Mass.:
65643.35
Organism:
Equus caballus (Horse)
Description:
P81908
Residue:
574
  
Inhibitor
Name:
BDBM50211401
Synonyms:
CHEMBL3905613
Type:
Small organic molecule
Emp. Form.:
C17H17Cl2NO2
Mol. Mass.:
338.228
SMILES:
CC(C)c1ccc(C)cc1OC(=O)Nc1ccc(Cl)c(Cl)c1
: