Target
Cholinesterase
Ligand
BDBM50211407
Substrate
Meas. Tech.
ChEMBL_1636437 (CHEMBL3879335)
IC50
510±n/a nM
Citation
 Kurt, BZGazioglu, IDag, ASalmas, REKayik, GDurdagi, SSonmez, F Synthesis, anticholinesterase activity and molecular modeling study of novel carbamate-substituted thymol/carvacrol derivatives. Bioorg Med Chem 25:1352-1363 (2017)  
Target
Name:
Cholinesterase
Synonyms:
BCHE CHLE_HORSE | Cholinesterase
Type:
Enzyme
Mol. Mass.:
65643.35
Organism:
Equus caballus (Horse)
Description:
P81908
Residue:
574
  
Inhibitor
Name:
BDBM50211407
Synonyms:
CHEMBL3936502
Type:
Small organic molecule
Emp. Form.:
C21H21NO2
Mol. Mass.:
319.3969
SMILES:
CC(C)c1ccc(C)c(OC(=O)Nc2cccc3ccccc23)c1
: