Target
Acetylcholinesterase
Ligand
BDBM50211403
Substrate
Meas. Tech.
ChEMBL_1636436 (CHEMBL3879334)
IC50
85700±n/a nM
Citation
 Kurt, BZGazioglu, IDag, ASalmas, REKayik, GDurdagi, SSonmez, F Synthesis, anticholinesterase activity and molecular modeling study of novel carbamate-substituted thymol/carvacrol derivatives. Bioorg Med Chem 25:1352-1363 (2017)  
Target
Name:
Acetylcholinesterase
Synonyms:
ACES_ELEEL Acetylcholinesterase (EeAChE) | ache
Type:
Enzyme
Mol. Mass.:
71812.79
Organism:
Electrophorus electricus (Electric eel)
Description:
Residue:
633
  
Inhibitor
Name:
BDBM50211403
Synonyms:
CHEMBL3967721
Type:
Small organic molecule
Emp. Form.:
C18H18F3NO2
Mol. Mass.:
337.3362
SMILES:
CC(C)c1ccc(C)c(OC(=O)Nc2ccc(cc2)C(F)(F)F)c1
: