Target
Cholinesterase
Ligand
BDBM50211469
Substrate
Meas. Tech.
ChEMBL_1636437 (CHEMBL3879335)
IC50
1050±n/a nM
Citation
 Kurt, BZGazioglu, IDag, ASalmas, REKayik, GDurdagi, SSonmez, F Synthesis, anticholinesterase activity and molecular modeling study of novel carbamate-substituted thymol/carvacrol derivatives. Bioorg Med Chem 25:1352-1363 (2017)  
Target
Name:
Cholinesterase
Synonyms:
BCHE CHLE_HORSE | Cholinesterase
Type:
Enzyme
Mol. Mass.:
65643.35
Organism:
Equus caballus (Horse)
Description:
P81908
Residue:
574
  
Inhibitor
Name:
BDBM50211469
Synonyms:
CHEMBL3946935
Type:
Small organic molecule
Emp. Form.:
C17H18N2O4
Mol. Mass.:
314.3358
SMILES:
CC(C)c1ccc(C)c(OC(=O)Nc2ccc(cc2)[N+]([O-])=O)c1
: