Target
Cholinesterase
Ligand
BDBM50211405
Substrate
Meas. Tech.
ChEMBL_1636437 (CHEMBL3879335)
IC50
1450±n/a nM
Citation
 Kurt, BZGazioglu, IDag, ASalmas, REKayik, GDurdagi, SSonmez, F Synthesis, anticholinesterase activity and molecular modeling study of novel carbamate-substituted thymol/carvacrol derivatives. Bioorg Med Chem 25:1352-1363 (2017)  
Target
Name:
Cholinesterase
Synonyms:
BCHE CHLE_HORSE | Cholinesterase
Type:
Enzyme
Mol. Mass.:
65643.35
Organism:
Equus caballus (Horse)
Description:
P81908
Residue:
574
  
Inhibitor
Name:
BDBM50211405
Synonyms:
CHEMBL3983884
Type:
Small organic molecule
Emp. Form.:
C18H21NO2
Mol. Mass.:
283.3648
SMILES:
CC(C)c1ccc(C)cc1OC(=O)NCc1ccccc1
: