Target
Acetylcholinesterase
Ligand
BDBM50211473
Substrate
Meas. Tech.
ChEMBL_1636436 (CHEMBL3879334)
IC50
2220±n/a nM
Citation
 Kurt, BZGazioglu, IDag, ASalmas, REKayik, GDurdagi, SSonmez, F Synthesis, anticholinesterase activity and molecular modeling study of novel carbamate-substituted thymol/carvacrol derivatives. Bioorg Med Chem 25:1352-1363 (2017)  
Target
Name:
Acetylcholinesterase
Synonyms:
ACES_ELEEL Acetylcholinesterase (EeAChE) | ache
Type:
Enzyme
Mol. Mass.:
71812.79
Organism:
Electrophorus electricus (Electric eel)
Description:
Residue:
633
  
Inhibitor
Name:
BDBM50211473
Synonyms:
CHEMBL3918594
Type:
Small organic molecule
Emp. Form.:
C17H18FNO2
Mol. Mass.:
287.3287
SMILES:
CC(C)c1ccc(C)c(OC(=O)Nc2cccc(F)c2)c1
: