Target
Cholinesterase
Ligand
BDBM50211412
Substrate
Meas. Tech.
ChEMBL_1636437 (CHEMBL3879335)
IC50
300±n/a nM
Citation
 Kurt, BZGazioglu, IDag, ASalmas, REKayik, GDurdagi, SSonmez, F Synthesis, anticholinesterase activity and molecular modeling study of novel carbamate-substituted thymol/carvacrol derivatives. Bioorg Med Chem 25:1352-1363 (2017)  
Target
Name:
Cholinesterase
Synonyms:
BCHE CHLE_HORSE | Cholinesterase
Type:
Enzyme
Mol. Mass.:
65643.35
Organism:
Equus caballus (Horse)
Description:
P81908
Residue:
574
  
Inhibitor
Name:
BDBM50211412
Synonyms:
CHEMBL3917505
Type:
Small organic molecule
Emp. Form.:
C18H27NO2
Mol. Mass.:
289.4125
SMILES:
CC(C)c1ccc(C)c(OC(=O)NCC2CCCCC2)c1
: