Target
Type-1 angiotensin II receptor A/B
Ligand
BDBM50212600
Substrate
Meas. Tech.
ChEMBL_36330 (CHEMBL650157)
Ki
4.8±n/a nM
Citation
  TBA Bioorg Med Chem Lett 2:1115-1120 (1992)   
Target
Name:
Type-1 angiotensin II receptor A/B
Synonyms:
Angiotensin II receptor (AT-1) type-1 | Type-1A/Type-1B angiotensin II receptor
Type:
Mol. Mass.:
Description:
ASSAY_ID of ChEMBL is 901964
Components:
This complex has 2 components.
Component 1
Name:
Type-1 angiotensin II receptor B
Synonyms:
AGTRB_RAT Agtr1 Angiotensin II AT1B Angiotensin II type 1b (AT-1b) receptor Type-1B angiotensin II receptor
Type:
Enzyme Catalytic Domain
Mol. Mass.:
40929.44
Organism:
RAT
Description:
Angiotensin II AT1B 0 RAT::P29089
Residue:
359
  
Component 2
Name:
Type-1 angiotensin II receptor A
Synonyms:
AGTRA_RAT Agtr1 Angiotensin II AT1 Angiotensin II receptor (AT-1) type-1 Type-1A angiotensin II receptor
Type:
Enzyme Catalytic Domain
Mol. Mass.:
40910.53
Organism:
RAT
Description:
ANGIOTENSIN AT1 AGTR1 RAT::P25095
Residue:
359
  
Inhibitor
Name:
BDBM50212600
Synonyms:
CHEMBL274887
Type:
Small organic molecule
Emp. Form.:
C24H22N6O2S2
Mol. Mass.:
490.6
SMILES:
CCCSC1=NS(=O)(=O)c2ccccc2N1Cc1ccc(cc1)-c1ccccc1-c1nn[nH]n1
: