Target
Alpha-1A adrenergic receptor
Ligand
BDBM50070328
Substrate
Meas. Tech.
ChEMBL_32313 (CHEMBL646167)
Ki
6026±n/a nM
Citation
  TBA Bioorg Med Chem Lett 4:2317-2322 (1994)   
Target
Name:
Alpha-1A adrenergic receptor
Synonyms:
ADA1A_HUMAN ADRA1C Alpha 1A-adrenoceptor Alpha adrenergic receptor 1a Alpha-adrenergic receptor 1c adrenergic Alpha1 | adrenergic Alpha1C
Type:
Cell-surface receptors
Mol. Mass.:
51511.67
Organism:
Homo sapiens (Human)
Description:
P35348
Residue:
466
  
Inhibitor
Name:
BDBM50070328
Synonyms:
CHEBI:8862 | Rilmenidine
Type:
Small organic molecule
Emp. Form.:
C10H16N2O
Mol. Mass.:
180.2468
SMILES:
C1CC1C(NC1=NCCO1)C1CC1
: