Target
D(2) dopamine receptor
Ligand
BDBM85027
Substrate
Meas. Tech.
ChEBML_58631
Ki
316±n/a nM
Citation
  TBA Bioorg Med Chem Lett 5:2119-2122 (1995)   
Target
Name:
D(2) dopamine receptor
Synonyms:
D(2) dopamine receptor DOPAMINE D2 Long DRD2 Dopamine D2 receptor Dopamine D2 receptor (D2R) Dopamine2-like | d2
Type:
Cell-surface receptors
Mol. Mass.:
50647.10
Organism:
Homo sapiens (Human)
Description:
P14416
Residue:
443
  
Inhibitor
Name:
BDBM85027
Synonyms:
1-(7-Chloro-8-amino-1,4-benzodioxane-5-yl)-3-[1-[3-(3,4-dimethoxyphenyl)propyl]piperidine-4-yl]propane-1-one | RS 100235
Type:
Small organic molecule
Emp. Form.:
C27H35ClN2O5
Mol. Mass.:
503.03
SMILES:
COc1ccc(CCCN2CCC(CCC(=O)c3cc(Cl)c(N)c4OCCOc34)CC2)cc1OC
: