Target
Muscarinic acetylcholine receptor M2
Ligand
BDBM85027
Substrate
Meas. Tech.
ChEBML_140123
Ki
1259±n/a nM
Citation
  TBA Bioorg Med Chem Lett 5:2119-2122 (1995)   
Target
Name:
Muscarinic acetylcholine receptor M2
Synonyms:
ACM2_HUMAN Cholinergic, muscarinic M2 Muscarinic acetylcholine receptor M2 and M5 | RecName: Full=Muscarinic acetylcholine receptor M2
Type:
GPCR
Mol. Mass.:
51730.61
Organism:
Homo sapiens (Human)
Description:
P08172
Residue:
466
  
Inhibitor
Name:
BDBM85027
Synonyms:
1-(7-Chloro-8-amino-1,4-benzodioxane-5-yl)-3-[1-[3-(3,4-dimethoxyphenyl)propyl]piperidine-4-yl]propane-1-one | RS 100235
Type:
Small organic molecule
Emp. Form.:
C27H35ClN2O5
Mol. Mass.:
503.03
SMILES:
COc1ccc(CCCN2CCC(CCC(=O)c3cc(Cl)c(N)c4OCCOc34)CC2)cc1OC
: