Target
5-hydroxytryptamine receptor 1A
Ligand
BDBM85027
Substrate
Meas. Tech.
ChEBML_1580
Ki
1000±n/a nM
Citation
  TBA Bioorg Med Chem Lett 5:2119-2122 (1995)   
Target
Name:
5-hydroxytryptamine receptor 1A
Synonyms:
5-HT1A 5-hydroxytryptamine receptor 1A (5HT1A) Gpcr18 Serotonin 1a (5-HT1a) receptor
Type:
Enzyme
Mol. Mass.:
46192.09
Organism:
Mus musculus (Mouse)
Description:
Q64264
Residue:
421
  
Inhibitor
Name:
BDBM85027
Synonyms:
1-(7-Chloro-8-amino-1,4-benzodioxane-5-yl)-3-[1-[3-(3,4-dimethoxyphenyl)propyl]piperidine-4-yl]propane-1-one | RS 100235
Type:
Small organic molecule
Emp. Form.:
C27H35ClN2O5
Mol. Mass.:
503.03
SMILES:
COc1ccc(CCCN2CCC(CCC(=O)c3cc(Cl)c(N)c4OCCOc34)CC2)cc1OC
: