Target
C-X-C chemokine receptor type 1/2
Ligand
BDBM50214177
Substrate
Meas. Tech.
ChEMBL_89096 (CHEMBL696550)
Ki
1850000±n/a nM
Citation
  TBA Bioorg Med Chem Lett 6:1869-1874 (1996)   
Target
Name:
C-X-C chemokine receptor type 1/2
Synonyms:
Interleukin-8 receptors, CXCR1/CXCR2
Type:
Mol. Mass.:
Description:
ASSAY_ID of ChEMBL is 89096
Components:
This complex has 2 components.
Component 1
Name:
C-X-C chemokine receptor type 1
Synonyms:
C-X-C chemokine receptor type 1 (CXCR-1) CMKAR1 CXCR1_HUMAN Interleukin-8 receptor A | Interleukin-8 receptors, CXCR1/CXCR2
Type:
Enzyme
Mol. Mass.:
39803.83
Organism:
Homo sapiens (Human)
Description:
P25024
Residue:
350
  
Component 2
Name:
C-X-C chemokine receptor type 2
Synonyms:
C-X-C chemokine receptor type 2 (CXCR-2) CD_antigen=CD182 CXCR-2 CXCR2_HUMAN GRO/MGSA receptor IL-8 receptor type 2 IL8RB | Interleukin-8 receptor B
Type:
Protein
Mol. Mass.:
40767.88
Organism:
Homo sapiens (Human)
Description:
P25025
Residue:
360
  
Inhibitor
Name:
BDBM50214177
Synonyms:
CHEMBL409189
Type:
Small organic molecule
Emp. Form.:
C65H90N14O23S
Mol. Mass.:
1467.555
SMILES:
CSCC[C@H](NC(=O)CNC(=O)[C@@H](NC(=O)[C@H](Cc1ccccc1)NC(C)=O)[C@@H](C)O)C(=O)N1CCC[C@H]1C(=O)N1CCC[C@H]1C(=O)N[C@@H](C)C(=O)N[C@@H](CC(O)=O)C(=O)N[C@@H](CCC(O)=O)C(=O)N[C@@H](CC(O)=O)C(=O)N[C@@H](Cc1ccc(O)cc1)C(=O)N[C@@H](CO)C(=O)N1CCC[C@H]1C(N)=O
: