Target
Histamine H3 receptor
Ligand
BDBM22914
Substrate
Meas. Tech.
ChEMBL_86928 (CHEMBL697537)
Ki
2.0±n/a nM
Citation
  TBA Bioorg Med Chem Lett 6:833-838 (1996)   
Target
Name:
Histamine H3 receptor
Synonyms:
HH3R Hrh3
Type:
G Protein-Coupled Receptor (GPCR)
Mol. Mass.:
48607.98
Organism:
Rattus norvegicus (rat)
Description:
Residue:
445
  
Inhibitor
Name:
BDBM22914
Synonyms:
CHEMBL260374 Thioperamide | US11622967, Compound Thioperamide
Type:
Small organic molecule
Emp. Form.:
C15H24N4S
Mol. Mass.:
292.443
SMILES:
S=C(NC1CCCCC1)N1CCC(CC1)c1cnc[nH]1
: