Target
Substance-P receptor
Ligand
BDBM50213831
Substrate
Meas. Tech.
ChEMBL_143039 (CHEMBL750288)
Ki
0.063096±n/a nM
Citation
  TBA Bioorg Med Chem Lett 6:1015-1020 (1996)   
Target
Name:
Substance-P receptor
Synonyms:
NK-1 receptor NK1 Receptor NK1R_HUMAN Neurokinin-1 (NK-1) SPR TACR1 Tachykinin receptor 1 (NK1) | tachykinin
Type:
G Protein-Coupled Receptor (GPCR)
Mol. Mass.:
46254.43
Organism:
Homo sapiens (Human)
Description:
P25103
Residue:
407
  
Inhibitor
Name:
BDBM50213831
Synonyms:
CHEMBL544891
Type:
Small organic molecule
Emp. Form.:
C21H28Cl2N6O3S
Mol. Mass.:
515.456
SMILES:
Cl.Cl.COc1ccc(cc1CN[C@H]1CCCN[C@H]1c1ccccc1)-n1nnnc1S(C)(=O)=O
: