Target
Phosphoglycerate kinase 1
Ligand
BDBM50216709
Substrate
Meas. Tech.
ChEMBL_371 (CHEMBL825022)
IC50
68800±n/a nM
Citation
 Caplan, NAPogson, CIHayes, DJBlackburn, GM Novel bisphosphonate inhibitors of phosphoglycerate kinase. Bioorg Med Chem Lett 8:515-20 (1998)  
Target
Name:
Phosphoglycerate kinase 1
Synonyms:
Cell migration-inducing gene 10 protein PGK1_HUMAN PGKA Phosphoglycerate kinase 1 | Primer recognition protein 2
Type:
PROTEIN
Mol. Mass.:
44619.74
Organism:
Homo sapiens (Human)
Description:
ChEMBL_104832
Residue:
417
  
Inhibitor
Name:
BDBM50216709
Synonyms:
CHEMBL148780
Type:
Small organic molecule
Emp. Form.:
C8H12O7P2
Mol. Mass.:
282.1242
SMILES:
OC(c1cccc(CP(O)(O)=O)c1)P(O)(O)=O
: