Target
Phosphoglycerate kinase 1
Ligand
BDBM50216715
Substrate
Meas. Tech.
ChEMBL_371 (CHEMBL825022)
IC50
99000±n/a nM
Citation
 Caplan, NAPogson, CIHayes, DJBlackburn, GM Novel bisphosphonate inhibitors of phosphoglycerate kinase. Bioorg Med Chem Lett 8:515-20 (1998)  
Target
Name:
Phosphoglycerate kinase 1
Synonyms:
Cell migration-inducing gene 10 protein PGK1_HUMAN PGKA Phosphoglycerate kinase 1 | Primer recognition protein 2
Type:
PROTEIN
Mol. Mass.:
44619.74
Organism:
Homo sapiens (Human)
Description:
ChEMBL_104832
Residue:
417
  
Inhibitor
Name:
BDBM50216715
Synonyms:
CHEMBL151547
Type:
Small organic molecule
Emp. Form.:
C9H14O6P2
Mol. Mass.:
280.1514
SMILES:
Cc1cc(CP(O)(O)=O)cc(CP(O)(O)=O)c1
: