Target
Phosphoglycerate kinase 1
Ligand
BDBM50216722
Substrate
Meas. Tech.
ChEMBL_371 (CHEMBL825022)
IC50
8000±n/a nM
Citation
 Caplan, NAPogson, CIHayes, DJBlackburn, GM Novel bisphosphonate inhibitors of phosphoglycerate kinase. Bioorg Med Chem Lett 8:515-20 (1998)  
Target
Name:
Phosphoglycerate kinase 1
Synonyms:
Cell migration-inducing gene 10 protein PGK1_HUMAN PGKA Phosphoglycerate kinase 1 | Primer recognition protein 2
Type:
PROTEIN
Mol. Mass.:
44619.74
Organism:
Homo sapiens (Human)
Description:
ChEMBL_104832
Residue:
417
  
Inhibitor
Name:
BDBM50216722
Synonyms:
CHEMBL149115
Type:
Small organic molecule
Emp. Form.:
C8H11ClO6P2
Mol. Mass.:
300.57
SMILES:
OP(O)(=O)Cc1cccc(c1)C(Cl)P(O)(O)=O
: