Target
3-oxo-5-alpha-steroid 4-dehydrogenase 1/2
Ligand
BDBM50215529
Substrate
Meas. Tech.
ChEMBL_204601 (CHEMBL813363)
IC50
1.5±n/a nM
Citation
 Sato, HKitagawa, OAida, YChikazawa, JKurimoto, TTakei, MFukuta, YYoshida, K Dual-acting agents with alpha1-adrenoceptor antagonistic and steroid 5alpha-reductase inhibitory activities. Synthesis and evaluation of arylpiperazine derivatives. Bioorg Med Chem Lett 9:1553-8 (1999)  
Target
Name:
3-oxo-5-alpha-steroid 4-dehydrogenase 1/2
Synonyms:
Steroid 5-alpha-reductase
Type:
Mol. Mass.:
Description:
ASSAY_ID of ChEMBL is 204723
Components:
This complex has 2 components.
Component 1
Name:
3-oxo-5-alpha-steroid 4-dehydrogenase 1
Synonyms:
S5A1_RAT Steroid 5-alpha-reductase | Steroid 5-alpha-reductase 1
Type:
PROTEIN
Mol. Mass.:
29788.29
Organism:
Rattus norvegicus
Description:
ChEMBL_1441437
Residue:
259
  
Component 2
Name:
3-oxo-5-alpha-steroid 4-dehydrogenase 2
Synonyms:
S5A2_RAT Steroid 5-alpha-reductase | Steroid 5-alpha-reductase 2
Type:
PROTEIN
Mol. Mass.:
28784.15
Organism:
Rattus norvegicus
Description:
ChEMBL_205054
Residue:
254
  
Inhibitor
Name:
BDBM50215529
Synonyms:
CHEMBL39419
Type:
Small organic molecule
Emp. Form.:
C42H47N3O6
Mol. Mass.:
689.8391
SMILES:
CCOc1ccccc1N1CCN(CCCOc2cc(ccc2OCc2ccc(C)cc2)C(=O)c2cn(CCCC(O)=O)c3ccccc23)CC1
: