Target
Genome polyprotein
Ligand
BDBM50158797
Substrate
Meas. Tech.
ChEMBL_79050 (CHEMBL687026)
IC50
36700±n/a nM
Citation
 Chu, MMierzwa, RHe, LKing, APatel, MPichardo, JHart, AButkiewicz, NPuar, MS Isolation and structure of SCH 351633: a novel hepatitis C virus (HCV) NS3 protease inhibitor from the fungus Penicillium griseofulvum. Bioorg Med Chem Lett 9:1949-52 (1999)  
Target
Name:
Genome polyprotein
Synonyms:
Hepatitis C virus NS3 protease/helicase | Hepatitis C virus serine protease, NS3/NS4A
Type:
Protein
Mol. Mass.:
67067.41
Organism:
Hepatitis C virus
Description:
A3EZI9
Residue:
631
  
Inhibitor
Name:
BDBM50158797
Synonyms:
Acetic acid 2-oxo-2,6-dihydro-4H-furo[3,2-c]pyran-4-yl ester | CHEMBL61801
Type:
Small organic molecule
Emp. Form.:
C9H8O5
Mol. Mass.:
196.1568
SMILES:
CC(=O)OC1OCC=C2OC(=O)C=C12
: