Target
Muscarinic acetylcholine receptor M4
Ligand
BDBM50219354
Substrate
Meas. Tech.
ChEMBL_139240 (CHEMBL746455)
Ki
12023±n/a nM
Citation
 Böhme, TMKeim, CDannhardt, GMutschler, ELambrecht, G Design and pharmacology of quinuclidine derivatives as M2-selective muscarinic receptor ligands. Bioorg Med Chem Lett 11:1241-3 (2001)  
Target
Name:
Muscarinic acetylcholine receptor M4
Synonyms:
ACM4_HUMAN Cholinergic, muscarinic M4 Muscarinic acetylcholine receptor M2 and M4
Type:
Enzyme Catalytic Domain
Mol. Mass.:
53079.31
Organism:
Homo sapiens (Human)
Description:
Cholinergic, muscarinic M4 CHRM4 HUMAN M3::P08173
Residue:
479
  
Inhibitor
Name:
BDBM50219354
Synonyms:
CHEMBL21509
Type:
Small organic molecule
Emp. Form.:
C19H20N2
Mol. Mass.:
276.3755
SMILES:
CN(C)CCC1=C\C(=C/c2ccccn2)c2ccccc12
: