Target
Muscarinic acetylcholine receptor M1
Ligand
BDBM50219392
Substrate
Meas. Tech.
ChEMBL_138539 (CHEMBL746257)
Ki
12023±n/a nM
Citation
 Böhme, TMKeim, CDannhardt, GMutschler, ELambrecht, G Design and pharmacology of quinuclidine derivatives as M2-selective muscarinic receptor ligands. Bioorg Med Chem Lett 11:1241-3 (2001)  
Target
Name:
Muscarinic acetylcholine receptor M1
Synonyms:
ACM1_HUMAN Cholinergic receptor, muscarinic 1 | Cholinergic, muscarinic M1
Type:
Protein
Mol. Mass.:
51442.54
Organism:
Homo sapiens (Human)
Description:
P11229
Residue:
460
  
Inhibitor
Name:
BDBM50219392
Synonyms:
CHEMBL278129
Type:
Small organic molecule
Emp. Form.:
C20H20N2O2
Mol. Mass.:
320.385
SMILES:
CN(C)CCOC(=O)C1=C\C(=C/c2ccncc2)c2ccccc12
: