Target
Muscarinic acetylcholine receptor M2
Ligand
BDBM50219396
Substrate
Meas. Tech.
ChEMBL_139885 (CHEMBL857563)
Ki
324±n/a nM
Citation
 Böhme, TMKeim, CDannhardt, GMutschler, ELambrecht, G Design and pharmacology of quinuclidine derivatives as M2-selective muscarinic receptor ligands. Bioorg Med Chem Lett 11:1241-3 (2001)  
Target
Name:
Muscarinic acetylcholine receptor M2
Synonyms:
ACM2_HUMAN Cholinergic, muscarinic M2 Muscarinic acetylcholine receptor M2 and M5 | RecName: Full=Muscarinic acetylcholine receptor M2
Type:
GPCR
Mol. Mass.:
51730.61
Organism:
Homo sapiens (Human)
Description:
P08172
Residue:
466
  
Inhibitor
Name:
BDBM50219396
Synonyms:
CHEMBL21716
Type:
Small organic molecule
Emp. Form.:
C23H22N2O2
Mol. Mass.:
358.433
SMILES:
O=C(OC1CN2CCC1CC2)C1=C\C(=C/c2ccccn2)c2ccccc12
: