Target
Muscarinic acetylcholine receptor M2
Ligand
BDBM82423
Substrate
Meas. Tech.
ChEMBL_139885 (CHEMBL857563)
Ki
0.269153±n/a nM
Citation
 Böhme, TMKeim, CDannhardt, GMutschler, ELambrecht, G Design and pharmacology of quinuclidine derivatives as M2-selective muscarinic receptor ligands. Bioorg Med Chem Lett 11:1241-3 (2001)  
Target
Name:
Muscarinic acetylcholine receptor M2
Synonyms:
ACM2_HUMAN Cholinergic, muscarinic M2 Muscarinic acetylcholine receptor M2 and M5 | RecName: Full=Muscarinic acetylcholine receptor M2
Type:
GPCR
Mol. Mass.:
51730.61
Organism:
Homo sapiens (Human)
Description:
P08172
Residue:
466
  
Inhibitor
Name:
BDBM82423
Synonyms:
CAS_132947 TRIPITRAMINE
Type:
Small organic molecule
Emp. Form.:
C64H77N13O6
Mol. Mass.:
1124.3797
SMILES:
CN(CCCCCCCCN(C)CCCCCCN(CC(=O)N1c2ccccc2C(=O)Nc2cccnc12)CC(=O)N1c2ccccc2C(=O)Nc2cccnc12)CCCCCCNCC(=O)N1c2ccccc2C(=O)Nc2cccnc12
: