Target
Muscarinic acetylcholine receptor M1
Ligand
BDBM50219393
Substrate
Meas. Tech.
ChEMBL_138539 (CHEMBL746257)
Ki
891±n/a nM
Citation
 Böhme, TMKeim, CDannhardt, GMutschler, ELambrecht, G Design and pharmacology of quinuclidine derivatives as M2-selective muscarinic receptor ligands. Bioorg Med Chem Lett 11:1241-3 (2001)  
Target
Name:
Muscarinic acetylcholine receptor M1
Synonyms:
ACM1_HUMAN Cholinergic receptor, muscarinic 1 | Cholinergic, muscarinic M1
Type:
Protein
Mol. Mass.:
51442.54
Organism:
Homo sapiens (Human)
Description:
P11229
Residue:
460
  
Inhibitor
Name:
BDBM50219393
Synonyms:
CHEMBL21321
Type:
Small organic molecule
Emp. Form.:
C23H22N2O2
Mol. Mass.:
358.433
SMILES:
O=C(OC1CN2CCC1CC2)C1=C\C(=C/c2cccnc2)c2ccccc12
: