Target
Oxytocin receptor
Ligand
BDBM50219508
Substrate
Meas. Tech.
ChEMBL_149055 (CHEMBL761409)
Ki
200±n/a nM
Citation
 Wyatt, PGAllen, MJChilcott, JFoster, ALivermore, DGMordaunt, JEScicinski, JWoollard, PM Identification of potent and selective oxytocin antagonists. Part 1: indole and benzofuran derivatives. Bioorg Med Chem Lett 12:1399-404 (2002)  
Target
Name:
Oxytocin receptor
Synonyms:
OT-R OXYR_HUMAN | Oxytocin
Type:
Enzyme Catalytic Domain
Mol. Mass.:
42793.26
Organism:
Homo sapiens (Human)
Description:
Oxytocin OXTR HEK293::B2R9L7
Residue:
389
  
Inhibitor
Name:
BDBM50219508
Synonyms:
CHEMBL31941
Type:
Small organic molecule
Emp. Form.:
C28H31N3O6S
Mol. Mass.:
537.627
SMILES:
CS(=O)(=O)N1CCC[C@@H]1Cc1coc2cc(ccc12)C(=O)N1CCC(CC1)N1C(=O)OCc2ccccc12
: