Target
Oxytocin receptor
Ligand
BDBM50219509
Substrate
Meas. Tech.
ChEMBL_149055 (CHEMBL761409)
Ki
6.3±n/a nM
Citation
 Wyatt, PGAllen, MJChilcott, JFoster, ALivermore, DGMordaunt, JEScicinski, JWoollard, PM Identification of potent and selective oxytocin antagonists. Part 1: indole and benzofuran derivatives. Bioorg Med Chem Lett 12:1399-404 (2002)  
Target
Name:
Oxytocin receptor
Synonyms:
OT-R OXYR_HUMAN | Oxytocin
Type:
Enzyme Catalytic Domain
Mol. Mass.:
42793.26
Organism:
Homo sapiens (Human)
Description:
Oxytocin OXTR HEK293::B2R9L7
Residue:
389
  
Inhibitor
Name:
BDBM50219509
Synonyms:
CHEMBL287325
Type:
Small organic molecule
Emp. Form.:
C30H28N4O6
Mol. Mass.:
540.5665
SMILES:
O=C(Cn1ccccc1=O)NCc1cc2cc(ccc2o1)C(=O)N1CCC(CC1)N1C(=O)OCc2ccccc12
: