Target
Oxytocin receptor
Ligand
BDBM50219517
Substrate
Meas. Tech.
ChEMBL_149055 (CHEMBL761409)
Ki
316±n/a nM
Citation
 Wyatt, PGAllen, MJChilcott, JFoster, ALivermore, DGMordaunt, JEScicinski, JWoollard, PM Identification of potent and selective oxytocin antagonists. Part 1: indole and benzofuran derivatives. Bioorg Med Chem Lett 12:1399-404 (2002)  
Target
Name:
Oxytocin receptor
Synonyms:
OT-R OXYR_HUMAN | Oxytocin
Type:
Enzyme Catalytic Domain
Mol. Mass.:
42793.26
Organism:
Homo sapiens (Human)
Description:
Oxytocin OXTR HEK293::B2R9L7
Residue:
389
  
Inhibitor
Name:
BDBM50219517
Synonyms:
CHEMBL285013
Type:
Small organic molecule
Emp. Form.:
C25H28N4O5S
Mol. Mass.:
496.579
SMILES:
CS(=O)(=O)NCCn1ccc2cc(ccc12)C(=O)N1CCC(CC1)N1C(=O)OCc2ccccc12
: