Target
Oxytocin receptor
Ligand
BDBM50219724
Substrate
Meas. Tech.
ChEMBL_149055 (CHEMBL761409)
Ki
398±n/a nM
Citation
 Wyatt, PGAllen, MJChilcott, JFoster, ALivermore, DGMordaunt, JEScicinski, JWoollard, PM Identification of potent and selective oxytocin antagonists. Part 1: indole and benzofuran derivatives. Bioorg Med Chem Lett 12:1399-404 (2002)  
Target
Name:
Oxytocin receptor
Synonyms:
OT-R OXYR_HUMAN | Oxytocin
Type:
Enzyme Catalytic Domain
Mol. Mass.:
42793.26
Organism:
Homo sapiens (Human)
Description:
Oxytocin OXTR HEK293::B2R9L7
Residue:
389
  
Inhibitor
Name:
BDBM50219724
Synonyms:
CHEMBL30865
Type:
Small organic molecule
Emp. Form.:
C30H36N4O5S
Mol. Mass.:
564.696
SMILES:
Cc1c(C)c2cc(ccc2n1C[C@H]1CCCN1S(C)(=O)=O)C(=O)N1CCC(CC1)N1C(=O)OCc2ccccc12
: