Target
Oxytocin receptor
Ligand
BDBM50219727
Substrate
Meas. Tech.
ChEMBL_149055 (CHEMBL761409)
Ki
3.2±n/a nM
Citation
 Wyatt, PGAllen, MJChilcott, JFoster, ALivermore, DGMordaunt, JEScicinski, JWoollard, PM Identification of potent and selective oxytocin antagonists. Part 1: indole and benzofuran derivatives. Bioorg Med Chem Lett 12:1399-404 (2002)  
Target
Name:
Oxytocin receptor
Synonyms:
OT-R OXYR_HUMAN | Oxytocin
Type:
Enzyme Catalytic Domain
Mol. Mass.:
42793.26
Organism:
Homo sapiens (Human)
Description:
Oxytocin OXTR HEK293::B2R9L7
Residue:
389
  
Inhibitor
Name:
BDBM50219727
Synonyms:
CHEMBL262384
Type:
Small organic molecule
Emp. Form.:
C29H29N5O7
Mol. Mass.:
559.5699
SMILES:
CN1CC(=O)N(CC(=O)NCc2cc3cc(ccc3o2)C(=O)N2CCC(CC2)N2C(=O)OCc3ccccc23)C1=O
: