Target
Corticotropin-releasing factor receptor 1/2
Ligand
BDBM50220497
Substrate
Meas. Tech.
ChEMBL_50970 (CHEMBL666051)
Ki
3.0±n/a nM
Citation
 Arvanitis, AGRescinito, JTArnold, CRWilde, RGFitzgerald, LWZaczek, RHartig, PRGrossman, SArneric, SPGilligan, PJOlson, RERobertson, DW Imidazo[4,5-c]pyridines as corticotropin releasing factor receptor ligands. Bioorg Med Chem Lett 13:129-31 (2003)  
Target
Name:
Corticotropin-releasing factor receptor 1/2
Synonyms:
Corticotropin releasing factor receptor
Type:
Mol. Mass.:
Description:
ASSAY_ID of ChEMBL is 217368
Components:
This complex has 2 components.
Component 1
Name:
Corticotropin-releasing factor receptor 1
Synonyms:
CRF-R CRFR1_RAT Corticotropin releasing factor receptor Corticotropin-releasing Factor Receptor 1 Crhr | Crhr1
Type:
G Protein-Coupled Receptor (GPCR)
Mol. Mass.:
47870.75
Organism:
Rattus norvegicus (rat)
Description:
Receptor binding assays were performed using rat cortex homogenate.
Residue:
415
  
Component 2
Name:
Corticotropin-releasing factor receptor 2
Synonyms:
CRF-R-2 CRF2 Beta CRFR2_RAT CRH-R2 Corticotropin-releasing factor receptor 2 Crf2r | Crhr2
Type:
Enzyme Catalytic Domain
Mol. Mass.:
47697.09
Organism:
RAT
Description:
CRF2 Beta 0 RAT::P47866
Residue:
411
  
Inhibitor
Name:
BDBM50220497
Synonyms:
CHEMBL285666
Type:
Small organic molecule
Emp. Form.:
C19H21Cl2N3
Mol. Mass.:
362.296
SMILES:
CCCC(C)n1c(CC)nc2c(nccc12)-c1ccc(Cl)cc1Cl
: