Target
Inosine-5'-monophosphate dehydrogenase 1/2
Ligand
BDBM50112571
Substrate
Meas. Tech.
ChEMBL_88591 (CHEMBL699983)
IC50
20000±n/a nM
Citation
 Pickett, SDSherborne, BSWilkinson, TBennett, JBorkakoti, NBroadhurst, MHurst, DKilford, IMcKinnell, MJones, PS Discovery of novel low molecular weight inhibitors of IMPDH via virtual needle screening. Bioorg Med Chem Lett 13:1691-4 (2003)  
Target
Name:
Inosine-5'-monophosphate dehydrogenase 1/2
Synonyms:
Inosine-5''''-monophosphate dehydrogenase (IMPDH) Inosine-5'-monophosphate dehydrogenase (IMPDH)
Type:
Mol. Mass.:
Description:
ASSAY_ID of ChEMBL is 88591
Components:
This complex has 2 components.
Component 1
Name:
Inosine-5'-monophosphate dehydrogenase 2
Synonyms:
IMDH2_HUMAN IMPD 2 IMPDH-II Inosine 5'-monophosphate dehydrogenase II (IMPDH II) Inosine-5 -monophosphate dehydrogenase 2 | Inosine-5'-monophosphate dehydrogenase (IMPDH)
Type:
Enzyme
Mol. Mass.:
55806.87
Organism:
Homo sapiens (Human)
Description:
Recombinant IMPDH2 expressed in E. coli.
Residue:
514
  
Component 2
Name:
Inosine-5'-monophosphate dehydrogenase 1
Synonyms:
IMDH1_HUMAN IMPD 1 IMPDH-I Inosine Monophosphate Dehydrogenase Type 1 (IMPDH1) | Inosine-5'-monophosphate dehydrogenase (IMPDH)
Type:
Enzyme
Mol. Mass.:
55407.70
Organism:
Homo sapiens (Human)
Description:
Recombinant IMPDH1 expressed in E. coli.
Residue:
514
  
Inhibitor
Name:
BDBM50112571
Synonyms:
CHEMBL27985 | N-tert-Butyl-N'-(4-oxazol-5-yl-phenyl)-oxalamide
Type:
Small organic molecule
Emp. Form.:
C15H17N3O3
Mol. Mass.:
287.3138
SMILES:
CC(C)(C)NC(=O)C(=O)Nc1ccc(cc1)-c1cnco1
: