Target
Phospho-N-acetylmuramoyl-pentapeptide-transferase
Ligand
BDBM50221211
Substrate
Meas. Tech.
ChEMBL_208265 (CHEMBL813225)
IC50
12.2±n/a nM
Citation
 Hotoda, HDaigo, MFurukawa, MMurayama, KHasegawa, CAKaneko, MMuramatsu, YIshii, MMMiyakoshi, STakatsu, TInukai, MKakuta, MAbe, TFukuoka, TUtsui, YOhya, S Synthesis and antimycobacterial activity of capuramycin analogues. Part 2: acylated derivatives of capuramycin-related compounds. Bioorg Med Chem Lett 13:2833-6 (2003)  
Target
Name:
Phospho-N-acetylmuramoyl-pentapeptide-transferase
Synonyms:
MRAY_ECOLI mraY | murX
Type:
PROTEIN
Mol. Mass.:
39889.38
Organism:
Escherichia coli (strain K12)
Description:
ChEMBL_1454117
Residue:
360
  
Inhibitor
Name:
BDBM50221211
Synonyms:
CHEMBL97077
Type:
Small organic molecule
Emp. Form.:
C23H26N4O11
Mol. Mass.:
534.4727
SMILES:
[H][C@@]1(O[C@H]([C@H](O)[C@@H]1OC)n1ccc(=O)[nH]c1=O)[C@@H](O[C@H]1OC(=C[C@H](O)[C@@H]1O)C(=O)Nc1ccccc1)C(N)=O
: