Target
Transient receptor potential cation channel subfamily V member 1/2/4
Ligand
BDBM20321
Substrate
Meas. Tech.
ChEMBL_177578 (CHEMBL783653)
IC50
37±n/a nM
Citation
 Suh, YGLee, YSMin, KHPark, OHSeung, HSKim, HDPark, HGChoi, JLee, JKang, SWOh, UTKoo, JYJoo, YHKim, SYKim, JKPark, YH Novel non-vanilloid VR1 antagonist of high analgesic effects and its structural requirement for VR1 antagonistic effects. Bioorg Med Chem Lett 13:4389-93 (2003)  
Target
Name:
Transient receptor potential cation channel subfamily V member 1/2/4
Synonyms:
Vanilloid receptor
Type:
Mol. Mass.:
Description:
ASSAY_ID of ChEMBL is 177578
Components:
This complex has 3 components.
Component 1
Name:
Transient receptor potential cation channel subfamily V member 2
Synonyms:
Sac2b Transient receptor potential cation channel subfamily V member 2 Vanilloid receptor | Vrl1
Type:
PROTEIN
Mol. Mass.:
86707.60
Organism:
Rattus norvegicus
Description:
ChEMBL_768011
Residue:
761
  
Component 2
Name:
Transient receptor potential cation channel subfamily V member 1
Synonyms:
Capsaicin receptor TRPV1_RAT Trpv1 Vanilloid VR1 Vanilloid receptor 1 (VRI/TRPV1) Vanilloid receptor type 1-like (TrpV1/Vr1) Vr1l | osm-9-like TRP channel 1
Type:
Transient Receptor
Mol. Mass.:
94956.12
Organism:
Rattus norvegicus (rat)
Description:
O35433
Residue:
838
  
Component 3
Name:
Transient receptor potential cation channel subfamily V member 4
Synonyms:
TRPV4_RAT Vanilloid receptor | Vroac
Type:
PROTEIN
Mol. Mass.:
98016.72
Organism:
Rattus norvegicus
Description:
ChEMBL_1514408
Residue:
871
  
Inhibitor
Name:
BDBM20321
Synonyms:
3-[(4-tert-butylphenyl)methyl]-1-[(3-fluoro-4-methanesulfonamidophenyl)methyl]thiourea JYL1421 | thiourea analogue, 2
Type:
Small organic molecule
Emp. Form.:
C20H26FN3O2S2
Mol. Mass.:
423.568
SMILES:
CC(C)(C)c1ccc(CNC(=S)NCc2ccc(NS(C)(=O)=O)c(F)c2)cc1
: