Target
Delta-type opioid receptor/Kappa-type opioid receptor/Mu-type opioid receptor/Sigma non-opioid intracellular receptor 1
Ligand
BDBM50000092
Substrate
Meas. Tech.
ChEMBL_147491 (CHEMBL754238)
IC50
27±n/a nM
Citation
 Mohacsi, ELeimgruber, WBaruth, H Synthesis and pharmacology of metabolically stable tert-butyl ethers of morphine and levorphanol. J Med Chem 25:1264-6 (1982)  
Target
Name:
Delta-type opioid receptor/Kappa-type opioid receptor/Mu-type opioid receptor/Sigma non-opioid intracellular receptor 1
Synonyms:
Opioid receptor
Type:
Mol. Mass.:
Description:
ASSAY_ID of ChEMBL is 146137
Components:
This complex has 4 components.
Component 1
Name:
Sigma non-opioid intracellular receptor 1
Synonyms:
Opioid receptor, sigma 1 SGMR1_MOUSE Sigma1-receptor Sigmar1
Type:
Enzyme Catalytic Domain
Mol. Mass.:
25246.51
Organism:
Mus musculus (Mouse)
Description:
O55242
Residue:
223
  
Component 2
Name:
Mu-type opioid receptor
Synonyms:
M-OR-1 Mor OPRM_MOUSE Oprm | Oprm1
Type:
Enzyme Catalytic Domain
Mol. Mass.:
44431.62
Organism:
MOUSE
Description:
OPIATE Mu OPRM1 MOUSE::P42866
Residue:
398
  
Component 3
Name:
Kappa-type opioid receptor
Synonyms:
KOR-1 OPIATE Kappa Oprk1
Type:
Enzyme
Mol. Mass.:
42656.78
Organism:
Mus musculus (Mouse)
Description:
P33534
Residue:
380
  
Component 4
Name:
Delta-type opioid receptor
Synonyms:
DOR-1 MSL-2 OPRD_MOUSE Oprd1
Type:
Enzyme Catalytic Domain
Mol. Mass.:
40577.25
Organism:
MOUSE
Description:
P32300
Residue:
372
  
Inhibitor
Name:
BDBM50000092
Synonyms:
(-)-(etorphine) (1S,5R,13R,14S)-12-oxa-4-azapentacyclo[9.6.1.01,13.05,17.07,18]octadeca-7(18),8,10,15-tetraene-10,14-diol (Morphine)4-methyl-(1S,5R,13R,14S,17R)-12-oxa-4-azapentacyclo[9.6.1.01,13.05,17.07,18]octadeca-7(18),8,10,15-tetraene-10,14-diol 1N-[2-(5-dimethylaminomethyl-2-furylmethylsulfanyl)ethyl]-1N-methyl-2-nitro-(Z)-1-ethene-1,1-diamine 2-{4-[2,4-diamino-6-pteridinylmethyl(methyl)amino]phenylcarboxamido}pentanedioic acid(morphine) 4-methyl-(1S,5R,13R,14S,17R)-12-oxa-4-azapentacyclo[9.6.1.01,13.05,17.07,18]octadeca-7(18),8,10,15-tetraene-10,14-diol 4-methyl-(1S,5R,13R,14S,17R)-12-oxa-4-azapentacyclo[9.6.1.01,13.05,17.07,18]octadeca-7(18),8,10,15-tetraene-10,14-diol ;sulphate salt(morphine) 4-methyl-(1S,5R,13R,14S,17R)-12-oxa-4-azapentacyclo[9.6.1.01,13.05,17.07,18]octadeca-7(18),8,10,15-tetraene-10,14-diol(Morphine sulfate) 4-methyl-(1S,5R,13R,14S,17R)-12-oxa-4-azapentacyclo[9.6.1.01,13.05,17.07,18]octadeca-7(18),8,10,15-tetraene-10,14-diol(morphine) 4-methyl-(1S,5R,13R,14S,17R)-12-oxa-4-azapentacyclo[9.6.1.01,13.05,17.07,18]octadeca-7(18),8,10,15-tetraene-10,14-diolMorphine 4-methyl-12-oxa-4-azapentacyclo[9.6.1.01,13.05,17.07,18]octadeca-7(18),8,10,15-tetraene-10,14-diol (morphine) 6,11-Dimethyl-3-(3-methyl-but-2-enyl)-1,2,3,4,5,6-hexahydro-2,6-methano-benzo[d]azocin-8-ol(Morphine) 7,8-Didehydro-4,5-epoxy-17-methylmorphinan-3,6-diol(morphine) AVINZA BDB50000092 CHEMBL70 DEPODUR INFUMORPH MORPHINE Morphine;4-methyl-(1S,5R,13R,14S,17R)-12-oxa-4-azapentacyclo[9.6.1.01,13.05,17.07,18]octadeca-7(18),8,10,15-tetraene-10,14-diol US9133125, Table D, morphine
Type:
Small organic molecule
Emp. Form.:
C17H19NO3
Mol. Mass.:
285.3377
SMILES:
CN1CC[C@@]23[C@H]4Oc5c2c(C[C@@H]1[C@@H]3C=C[C@@H]4O)ccc5O
: