Target
Delta-type opioid receptor/Kappa-type opioid receptor/Mu-type opioid receptor/Sigma non-opioid intracellular receptor 1
Ligand
BDBM50223880
Substrate
Meas. Tech.
ChEMBL_147492 (CHEMBL754239)
IC50
8500±n/a nM
Citation
 Kobylecki, RJLane, ACSmith, CFWakelin, LPCruse, WBEgert, EKennard, O N-Methylnalorphine: definition of N-allyl conformation for antagonism at the opiate receptor. J Med Chem 25:1278-80 (1982)  
Target
Name:
Delta-type opioid receptor/Kappa-type opioid receptor/Mu-type opioid receptor/Sigma non-opioid intracellular receptor 1
Synonyms:
Opioid receptor
Type:
Mol. Mass.:
Description:
ASSAY_ID of ChEMBL is 146137
Components:
This complex has 4 components.
Component 1
Name:
Sigma non-opioid intracellular receptor 1
Synonyms:
Opioid receptor, sigma 1 SGMR1_MOUSE Sigma1-receptor Sigmar1
Type:
Enzyme Catalytic Domain
Mol. Mass.:
25246.51
Organism:
Mus musculus (Mouse)
Description:
O55242
Residue:
223
  
Component 2
Name:
Mu-type opioid receptor
Synonyms:
M-OR-1 Mor OPRM_MOUSE Oprm | Oprm1
Type:
Enzyme Catalytic Domain
Mol. Mass.:
44431.62
Organism:
MOUSE
Description:
OPIATE Mu OPRM1 MOUSE::P42866
Residue:
398
  
Component 3
Name:
Kappa-type opioid receptor
Synonyms:
KOR-1 OPIATE Kappa Oprk1
Type:
Enzyme
Mol. Mass.:
42656.78
Organism:
Mus musculus (Mouse)
Description:
P33534
Residue:
380
  
Component 4
Name:
Delta-type opioid receptor
Synonyms:
DOR-1 MSL-2 OPRD_MOUSE Oprd1
Type:
Enzyme Catalytic Domain
Mol. Mass.:
40577.25
Organism:
MOUSE
Description:
P32300
Residue:
372
  
Inhibitor
Name:
BDBM50223880
Synonyms:
CHEMBL610906
Type:
Small organic molecule
Emp. Form.:
C20H24INO3
Mol. Mass.:
453.3139
SMILES:
[I-].[H][C@]12Oc3c4c(C[C@]5([H])C(C=C[C@@H]1O)[C@]24CC[N+]5(C)CC=C)ccc3O
: