Target
D(1A)/D(2) dopamine receptor
Ligand
BDBM50010698
Substrate
Meas. Tech.
ChEMBL_59598 (CHEMBL672155)
IC50
10.0±n/a nM
Citation
 Neumeyer, JLArana, GWRam, VJKula, NSBaldessarini, RJ Aporphines. 39. Synthesis, dopamine receptor binding, and pharmacological activity of (R)-(-)- and (S)-(+)-2-hydroxyapomorphine. J Med Chem 25:990-2 (1982)  
Target
Name:
D(1A)/D(2) dopamine receptor
Synonyms:
Dopamine receptor
Type:
Mol. Mass.:
Description:
ASSAY_ID of ChEMBL is 59578
Components:
This complex has 2 components.
Component 1
Name:
D(2) dopamine receptor
Synonyms:
DOPAMINE D2 DRD2_BOVIN | Dopamine D2 receptor
Type:
Enzyme Catalytic Domain
Mol. Mass.:
50698.79
Organism:
BOVINE
Description:
P20288
Residue:
444
  
Component 2
Name:
D(1A) dopamine receptor
Synonyms:
D(1A) dopamine receptor DOPAMINE D1 DRD1_BOVIN | Dopamine receptor
Type:
Enzyme Catalytic Domain
Mol. Mass.:
49330.65
Organism:
BOVINE
Description:
DOPAMINE D1 DRD1 BOVINE::Q95136
Residue:
446
  
Inhibitor
Name:
BDBM50010698
Synonyms:
(-)6-Methyl-5,6,6a,7-tetrahydro-4H-dibenzo[de,g]quinoline-2,10,11-triol 6-Methyl-5,6,6a,7-tetrahydro-4H-dibenzo[de,g]quinoline-2,10,11-triol | CHEMBL19130
Type:
Small organic molecule
Emp. Form.:
C17H17NO3
Mol. Mass.:
283.3218
SMILES:
CN1CCc2cc(O)cc-3c2[C@H]1Cc1ccc(O)c(O)c-31
: