Target
D(1A)/D(2) dopamine receptor
Ligand
BDBM50007425
Substrate
Meas. Tech.
ChEMBL_59454 (CHEMBL670112)
IC50
5.0±n/a nM
Citation
 Neumeyer, JLReischig, DArana, GWCampbell, ABaldessarini, RJKula, NSWatling, KJ Aporphines. 48. Enantioselectivity of (R)-(-)- and (S)-(+)-N-n-propylnorapomorphine on dopamine receptors. J Med Chem 26:516-21 (1983)  
Target
Name:
D(1A)/D(2) dopamine receptor
Synonyms:
Dopamine receptor
Type:
Mol. Mass.:
Description:
ASSAY_ID of ChEMBL is 59578
Components:
This complex has 2 components.
Component 1
Name:
D(2) dopamine receptor
Synonyms:
DOPAMINE D2 DRD2_BOVIN | Dopamine D2 receptor
Type:
Enzyme Catalytic Domain
Mol. Mass.:
50698.79
Organism:
BOVINE
Description:
P20288
Residue:
444
  
Component 2
Name:
D(1A) dopamine receptor
Synonyms:
D(1A) dopamine receptor DOPAMINE D1 DRD1_BOVIN | Dopamine receptor
Type:
Enzyme Catalytic Domain
Mol. Mass.:
49330.65
Organism:
BOVINE
Description:
DOPAMINE D1 DRD1 BOVINE::Q95136
Residue:
446
  
Inhibitor
Name:
BDBM50007425
Synonyms:
(S) 6-Propyl-5,6,6a,7-tetrahydro-4H-dibenzo[de,g]quinoline-10,11-diol (S)-6-propyl-5,6,6a,7-tetrahydro-4H-dibenzo[de,g]quinoline-10,11-diol | CHEMBL330274
Type:
Small organic molecule
Emp. Form.:
C19H21NO2
Mol. Mass.:
295.3755
SMILES:
CCCN1CCc2cccc-3c2[C@@H]1Cc1ccc(O)c(O)c-31
: