Target
D(1A)/D(2) dopamine receptor
Ligand
BDBM50224791
Substrate
Meas. Tech.
ChEMBL_59583 (CHEMBL672934)
IC50
40±n/a nM
Citation
 Nedelec, LPierdet, AFauveau, PEuvrard, CProulx-Ferland, LDumont, CLabrie, FBoissier, JR Synthesis and central dopaminergic activities of (+/-)-hexahydro-7H-indolo[3,4-gh][1,4]benzoxazine derivatives [(+/-)-9-oxaergolines]. J Med Chem 26:522-7 (1983)  
Target
Name:
D(1A)/D(2) dopamine receptor
Synonyms:
Dopamine receptor
Type:
Mol. Mass.:
Description:
ASSAY_ID of ChEMBL is 59578
Components:
This complex has 2 components.
Component 1
Name:
D(2) dopamine receptor
Synonyms:
DOPAMINE D2 DRD2_BOVIN | Dopamine D2 receptor
Type:
Enzyme Catalytic Domain
Mol. Mass.:
50698.79
Organism:
BOVINE
Description:
P20288
Residue:
444
  
Component 2
Name:
D(1A) dopamine receptor
Synonyms:
D(1A) dopamine receptor DOPAMINE D1 DRD1_BOVIN | Dopamine receptor
Type:
Enzyme Catalytic Domain
Mol. Mass.:
49330.65
Organism:
BOVINE
Description:
DOPAMINE D1 DRD1 BOVINE::Q95136
Residue:
446
  
Inhibitor
Name:
BDBM50224791
Synonyms:
CHEMBL333795 | RU-29717
Type:
Small organic molecule
Emp. Form.:
C16H20N2O
Mol. Mass.:
256.3428
SMILES:
[H][C@@]12Cc3c[nH]c4cccc(c34)[C@@]1([H])OCCN2CCC
: