Target
Delta-type opioid receptor/Kappa-type opioid receptor/Mu-type opioid receptor/Sigma non-opioid intracellular receptor 1
Ligand
BDBM50225255
Substrate
Meas. Tech.
ChEMBL_146018 (CHEMBL752709)
IC50
115±n/a nM
Citation
 Koolpe, GANelson, WLGioannini, TLAngel, LSimon, EJ Diastereomeric 6-desoxy-6-spiro-alpha-methylene-gamma-butyrolactone derivatives of naltrexone and oxymorphone. Selective irreversible inhibition of naltrexone binding in an opioid receptor preparation by a conformationally restricted michael acceptor ligand. J Med Chem 27:1718-23 (1984)  
Target
Name:
Delta-type opioid receptor/Kappa-type opioid receptor/Mu-type opioid receptor/Sigma non-opioid intracellular receptor 1
Synonyms:
Opioid receptor
Type:
Mol. Mass.:
Description:
ASSAY_ID of ChEMBL is 146137
Components:
This complex has 4 components.
Component 1
Name:
Sigma non-opioid intracellular receptor 1
Synonyms:
Opioid receptor, sigma 1 SGMR1_MOUSE Sigma1-receptor Sigmar1
Type:
Enzyme Catalytic Domain
Mol. Mass.:
25246.51
Organism:
Mus musculus (Mouse)
Description:
O55242
Residue:
223
  
Component 2
Name:
Mu-type opioid receptor
Synonyms:
M-OR-1 Mor OPRM_MOUSE Oprm | Oprm1
Type:
Enzyme Catalytic Domain
Mol. Mass.:
44431.62
Organism:
MOUSE
Description:
OPIATE Mu OPRM1 MOUSE::P42866
Residue:
398
  
Component 3
Name:
Kappa-type opioid receptor
Synonyms:
KOR-1 OPIATE Kappa Oprk1
Type:
Enzyme
Mol. Mass.:
42656.78
Organism:
Mus musculus (Mouse)
Description:
P33534
Residue:
380
  
Component 4
Name:
Delta-type opioid receptor
Synonyms:
DOR-1 MSL-2 OPRD_MOUSE Oprd1
Type:
Enzyme Catalytic Domain
Mol. Mass.:
40577.25
Organism:
MOUSE
Description:
P32300
Residue:
372
  
Inhibitor
Name:
BDBM50225255
Synonyms:
CHEMBL2310924
Type:
Small organic molecule
Emp. Form.:
C21H23NO5
Mol. Mass.:
369.411
SMILES:
[H][C@@]12Cc3ccc(O)c4OC5C6(CC(=C)C(=O)O6)CCC1(O)[C@@]5(CCN2C)c34
: