Target
Cysteinyl leukotriene receptor 1/2
Ligand
BDBM50225197
Substrate
Meas. Tech.
ChEMBL_75478 (CHEMBL687343)
IC50
200±n/a nM
Citation
 LeMahieu, RACarson, MHan, RJNason, WCO'Donnell, MBrown, DLCrowley, HJWelton, AF Substituted (aryloxy)alkanoic acids as antagonists of slow-reacting substance of anaphylaxis. J Med Chem 30:173-8 (1987)  
Target
Name:
Cysteinyl leukotriene receptor 1/2
Synonyms:
Cysteinyl leukotriene receptor
Type:
Mol. Mass.:
Description:
ASSAY_ID of ChEMBL is 98640
Components:
This complex has 2 components.
Component 1
Name:
Cysteinyl leukotriene receptor 1
Synonyms:
CLTR1_HUMAN CYSLTR1 Cysteinyl leukotriene receptor HG55 LTD4 receptor | Leukotriene Cysteinyl 1
Type:
Enzyme Catalytic Domain
Mol. Mass.:
38565.16
Organism:
Homo sapiens (Human)
Description:
Leukotriene Cysteinyl 1 CYSLTR1 HUMAN::Q9Y271
Residue:
337
  
Component 2
Name:
Cysteinyl leukotriene receptor 2
Synonyms:
CLTR2_HUMAN CYSLT2R Cysteinyl leukotriene receptor Leukotriene Cysteinyl 2
Type:
Enzyme Catalytic Domain
Mol. Mass.:
39657.52
Organism:
Homo sapiens (Human)
Description:
Leukotriene Cysteinyl 2 CYSLTR2 HUMAN::Q9NS75
Residue:
346
  
Inhibitor
Name:
BDBM50225197
Synonyms:
CHEMBL50987
Type:
Small organic molecule
Emp. Form.:
C32H44O9
Mol. Mass.:
572.6864
SMILES:
CCCc1c(O)c(ccc1OCCCOCCCOc1c(CCC)c(OCCCC(O)=O)ccc1C(C)=O)C(C)=O
: